{"text_format":"1","workbook":"xlsx","n_sheets":11,"sheets":["Inputs","Collection Route Parameters","Fuel and Labor Assumptions","Truck Assumptions","Municipalities","2012 Program Data","2012 Macro Cost Data","Look Up Table","Distance Between Household Data","Sheet3","Sheet5"],"not_rendered":{"charts":0,"images":11,"macros":1,"external_links":0,"defined_names":4,"comments":1,"pivot_tables":0},"unopened":[],"bounds":{"document_bytes":16777216,"sheet_cells":100000,"rows_first":2000,"rows_last":500,"rows_between":2000,"halvings":0,"cell_chars":16384,"cell_head_chars":4096},"cells_cut":0,"cells_raw":0,"read":"whole","date_system":"1900"}

{"sheet":"Inputs","index":0,"n_rows":36,"n_cols":6,"rows_kept":36,"cut":false,"hidden":false,"merged":[[3,5,12,10],[16,5,25,10],[26,5,35,10]]}
["INPUTS"]
["Select your region","Large Urban",{"$f":"IF(B2=\"Large Urban\",1,IF(B2=\"Urban Regional\",2,IF(B2=\"Medium Urban\",3,IF(B2=\"Small Urban\",4,IF(B2=\"Rural Regional\",5,IF(B2=\"Rural Collection - North\",6,IF(B2=\"Rural Collection - South\",7,8)))))))","v":1},null,null,"Region Description"]
["Select frequency of collection","Bi Weekly",{"$f":"IF(B3=\"Bi Weekly\",20,10)","v":20}]
["Select Single or Dual Stream Collection","Single",{"$f":"IF(B4=\"Single\",30,48)","v":30},null,null,{"$f":"IF(B2=\"Large Urban\",\" • Population greater than 250,000  • Population density greater than 4 residents per square km, Examples: Toronto, Peel\",IF(B2=\"Urban Regional\",\" • Population greater than 250,000 \n• Population density less than 4 residents per square km, Examples: Ottawa, Windsor\",IF(B2=\"Medium Urban\",\" • Population between 50,000 and 250,000 \n• Population density greater than 3 residents per square km , Examples: Barrie, Simcoe\",IF(B2=\"Small Urban\",\"• Population less than 50,000 \n• Population density greater than 4 residents per square km, Examples: Orangeville, St. Thomas\",IF(B2=\"Rural Collection - North\",\"• Population less than 50,000 \n• Population density less than 4 residents per square km \n• Located in the “North” as defined by O. Reg. 101/94 \n• Provide curbside collection service of Blue Box materials to at least 30% of households\n\",CONCATENATE(\"• Population less than 50,000 \n• Population density less than 4 residents per square km \n• Located in the “South” as defined by O. Reg. 101/94\",\n\"• Provide only depot collection service or a combination of depot and curbside collection with less than 30% of households receiving curbside collection of Blue Box materials\")\n)))))","v":" • Population greater than 250,000  • Population density greater than 4 residents per square km, Examples: Toronto, Peel"}]
[null,null,{"$f":"SUM(C2:C4)","v":51}]
["Select Collection Vehicle",169000]
[]
["Enter # of Collected Tonnes",172112]
{"$rows_left_out":29}
{"sheet":"Collection Route Parameters","index":1,"n_rows":55,"n_cols":18,"rows_kept":55,"cut":false,"hidden":false,"merged":[]}
["TRAVEL TIME  & DISTANCE","Time","Unit Conversion",null,null,null,null,"Municipalities","Weighted Average Distance Between Households","Tavel Time Between Households","Unit Conversion"]
["Travel time between houses urban",5,{"$f":"(B2/60)/60","v":1.3888888888888887E-3},"Ernsdorff et al, 2012",null,null,null,"Large Urban",{"$f":"Sheet3!B2","v":16.824490966446803},{"$f":"I2/((($B$9*1000)/60)/60)*1.5","v":6.0568167479208483},{"$f":"(J2/60)/60","v":1.6824490966446802E-3}]
["Travel time between houses rural",10,{"$f":"(B3/60)/60","v":2.7777777777777775E-3},"Ernsdorff et al, 2012",null,null,null,"Urban Regional",{"$f":"Sheet3!B3","v":8.8362111449796501},{"$f":"I3/((($B$9*1000)/60)/60)*1.5","v":3.1810360121926742},{"$f":"(J3/60)/60","v":8.8362111449796505E-4}]
["Travel time beteen multi residential",30,8.3333333333333332E-3,"Ernsdorff et al, 2012",null,null,null,"Medium Urban",{"$f":"Sheet3!B4","v":18.933124235374393},6.8159247247347814,1.8933124235374394E-3]
["Pick up and drop off time (x2)",20,{"$f":"(B5*2)/60","v":0.66666666666666663},"Ernsdorff et al, 2012",null,null,null,"Small Urban",{"$f":"Sheet3!B5","v":14.309438679108165},5.151397924478939,1.4309438679108164E-3]
["Distance to MRF/Transfer Station",null,null,null,null,null,null,"Rural Regional",{"$f":"Sheet3!B6","v":17.671934141888865},6.361896291079991,1.7671934141888863E-3]
["Distance Between Households",10,null,"Ernsdorff et al, 2012",null,null,null,"Rural Collection - North",{"$f":"Sheet3!B7","v":25.862448922383585},9.3104816120580907,2.5862448922383588E-3]
["Distance Between MF Households",25,null,"Ernsdorff et al, 2012",null,null,null,"Rural Collection - South",{"$f":"Sheet3!B8","v":23.872692609622071},8.5941693394639458,2.3872692609622072E-3]
{"$rows_left_out":48}
{"sheet":"Fuel and Labor Assumptions","index":2,"n_rows":10,"n_cols":2,"rows_kept":10,"cut":false,"hidden":false,"merged":[]}
["Labour Assumptions"]
["Crew Wage",25]
["Admin + Supervisor Wages",20]
["Total Labor Cost Per Hour",{"$f":"SUM(B2:B3)","v":45}]
["# of Working Hours Per Day",7.5]
["Average Crew Size",{"$f":"Inputs!B18","v":2}]
["Work days per week",{"$f":"Inputs!B19","v":5}]
[]
{"$rows_left_out":3}
{"sheet":"Truck Assumptions","index":3,"n_rows":16,"n_cols":2,"rows_kept":16,"cut":false,"hidden":false,"merged":[]}
["Truck Assumptions"]
["Capital Cost of Recycling Truck",{"$f":"Inputs!B6","v":169000}]
["Capacity of Recycling Truck",35]
["Density of Commingled Reyclables",220]
["Capacity of Recycling Truck",{"$f":"((B4/2.2)*B3)/1000","v":3.4999999999999996}]
["Average Truck Speed",40]
["Amortization Period",{"$f":"Inputs!B16","v":5}]
["Yearly Maintance",25000]
{"$rows_left_out":9}
{"sheet":"Municipalities","index":4,"n_rows":234,"n_cols":38,"rows_kept":234,"cut":false,"hidden":false,"merged":[[0,15,1,15],[0,21,1,21],[0,9,1,9],[0,13,1,13],[0,0,1,0],[0,1,1,1],[0,2,1,2],[0,6,1,6],[0,7,1,7],[0,14,1,14],[0,26,1,26],[0,27,1,27],[0,28,1,28],[0,22,1,22],[0,23,1,23],[0,24,1,24],[0,25,1,25]]}
["Group","PC","Municipality",null,null,null,"Total Households Served","TOTAL Reported and/or Calculated Marketed Tonnes1",null,"TOTAL Material Available for Pickup",null,null,null,"Number of households serviced before truck runs out of time","Number of households serviced before truck runs out of time","Number of Households serviced before run out of capacity (per day)",null,null,null,null,null,"Trucks Required For Five Day Work Week","Cost of truck fleet (per year)","# of Labor Hours Per week","# of Labor Hours Per year","Labor Costs Per Year","Kilometers travelled per trip","Kilometers travelled per year","Fuel use per Year"]
[null,null,null,"Single  Stream?","Household Serviced by Curbside Collection","Households Servied by Depot Collection",null,null,"Multi Family Households",null,"# of Pickups per year","Recyclable Generation per Household","Distance to Nearest MRF/Depot/Transfer Station",null,null,null,"Run out of Time or Run out of Space?","Number of Households serviced in an hour","Number of Households serviced in an hour","If run out of space, time left to return to collection (after drop off)","Max Households Serviced in a Day per Truck",null,null,null,null,null,null,null,null,"Fuel Costs Per Year","Collection Costs Per Year","Collection Costs Reported","Difference"]
["Large Urban",1,"HALTON, REGIONAL MUNICIPALITY OF","Y",{"$f":"VLOOKUP(B3,'2012 Program Data'!$B$30:$F$235,3,FALSE)","v":183677},{"$f":"VLOOKUP(B3,'2012 Program Data'!$B$6:$E$235,4,FALSE)","v":0},183677,41298.58,47000,{"$f":"H3*(1+$B$234)","v":45428.438000000009},{"$f":"VLOOKUP(B3,'2012 Program Data'!$B$6:$T$235,19,FALSE)","v":52},{"$f":"(J3/G3)/52","v":4.7563048595758196E-3},20,{"$f":"IF(AND(D3=\"Y\",F3<1,K3=52),'Collection Route Parameters'!$B$31,IF(AND(D3=\"N\",F3<1,K3=52),'Collection Route Parameters'!$B$33,IF(AND(D152=\"Y\",F152<1,K152=26),'Collection Route Parameters'!$B$32,'Collection Route Parameters'!$B$34)))","v":1229.5},{"$f":"IF(AND(D3=\"Y\",I3>0),($AL$15*(1-I3/G3)+($AL$23*(I3/G3))),IF(AND(D3=\"N\",I3>0),($AL$18*(1-I3/G3)+($AL$24*(I3/G3))),(N3)))","v":984.8038455791658},{"$f":"'Truck Assumptions'!$B$5/Municipalities!L3","v":735.86536257310877},{"$f":"IF(O3>P3,\"run out of space\", \"run out of time\")","v":"run out of space"},{"$f":"IF(N3=$AL$15,$AL$3,IF(N3=$AL$16,$AL$4,IF(N3=$AL$17,$AL$5,IF(N3=$AL$6,$AL$18,IF(N3=$AL$19,$AL$7,IF(N3=$AL$20,$AL$8,IF(N3=$AL$21,$AL$9,$AL$10)))))))","v":180.00000000000003},{"$f":"IF(AND(I3>0,D3=\"Y\"),(R3*(G3-I3)/G3)+($AL$11*I3/G3),IF(AND(I3>0,D3=\"N\"),(R3*(G3-I3)/G3)+($AL$12*I3/G3),R3))","v":144.17624416775104},{"$f":"IF(Q3=\"run out of space\",((N3-P3)/'Collection Route Parameters'!$B$43)-'Collection Route Parameters'!$B$54,\"\")","v":2.072970207927173},{"$f":"IF(AND(T3<>\"\",T3>0),(R3*T3)+P3,O3)","v":1109},{"$f":"ROUNDUP((G3/U3)/'Fuel and Labor Assumptions'!$B$7,0)","v":34},{"$f":"V3*'Truck Assumptions'!$B$16","v":2013604.8195788665},{"$f":"(V3*'Fuel and Labor Assumptions'!$B$5)*'Fuel and Labor Assumptions'!$B$6","v":510},{"$f":"X3*K3","v":26520},{"$f":"Y3*'Fuel and Labor Assumptions'!$B$4","v":1193400},{"$f":"(((U3*'Collection Route Parameters'!$B$7)*Municipalities!V3)/1000)+(M3*V3)","v":1057.06},{"$f":"AA3*K3","v":54967.119999999995},{"$f":"AB3*'Truck Assumptions'!$B$10","v":57990.311599999994},{"$f":"AC3*'Fuel and Labor Assumptions'!$B$10","v":77127.114428000001},{"$f":"AD3+Z3+W3","v":3284131.9340068665},{"$f":"VLOOKUP(B3,'2012 Macro Cost Data'!$B$5:$F$245,5,FALSE)","v":5130395.68},{"$f":"AE3-AF3","v":-1846263.7459931332},null,null,null,"Urban, Weekly, Single Stream ",{"$f":"'Collection Route Parameters'!B43","v":180.00000000000003}]
["Large Urban",20,"TORONTO, CITY OF","N",{"$f":"VLOOKUP(B4,'2012 Program Data'!$B$30:$F$235,3,FALSE)","v":879335},{"$f":"VLOOKUP(B4,'2012 Program Data'!$B$6:$E$235,4,FALSE)","v":0},1000936,156465,500000,172111.5,{"$f":"VLOOKUP(B4,'2012 Program Data'!$B$6:$T$235,19,FALSE)","v":26},3.3067414284844768E-3,20,{"$f":"IF(AND(D4=\"Y\",F4<1,K4=52),'Collection Route Parameters'!$B$31,IF(AND(D4=\"N\",F4<1,K4=52),'Collection Route Parameters'!$B$33,IF(AND(D153=\"Y\",F153<1,K153=26),'Collection Route Parameters'!$B$32,'Collection Route Parameters'!$B$34)))","v":847.75862068965523},547.08574016100238,{"$f":"'Truck Assumptions'!$B$5/Municipalities!L4","v":1058.4438111340612},{"$f":"IF(O4>P4,\"run out of space\", \"run out of time\")","v":"run out of time"},105.88235294117648,{"$f":"IF(AND(I4>0,D4=\"Y\"),(R4*(G4-I4)/G4)+($AL$11*I4/G4),IF(AND(I4>0,D4=\"N\"),(R4*(G4-I4)/G4)+($AL$12*I4/G4),R4))","v":70.973850828565645},{"$f":"IF(Q4=\"run out of space\",((N4-P4)/'Collection Route Parameters'!$B$43)-'Collection Route Parameters'!$B$54,\"\")","v":""},{"$f":"IF(AND(T4<>\"\",T4>0),(R4*T4)+P4,O4)","v":547.08574016100238},{"$f":"ROUNDUP((G4/U4)/'Fuel and Labor Assumptions'!$B$7,0)","v":366},{"$f":"V4*'Truck Assumptions'!$B$16","v":21675863.646054856},{"$f":"(V4*'Fuel and Labor Assumptions'!$B$5)*'Fuel and Labor Assumptions'!$B$6","v":5490},142740,{"$f":"Y4*'Fuel and Labor Assumptions'!$B$4","v":6423300},{"$f":"(((U4*'Collection Route Parameters'!$B$7)*Municipalities!V4)/1000)+(M4*V4)","v":9322.3338089892677},242380.67903372095,{"$f":"AB4*'Truck Assumptions'!$B$10","v":255711.61638057558},{"$f":"AC4*'Fuel and Labor Assumptions'!$B$10","v":340096.44978616555},28439260.09584102,{"$f":"VLOOKUP(B4,'2012 Macro Cost Data'!$B$5:$F$245,5,FALSE)","v":33215934.300000001},-4776674.2041589804,null,null,null,"Urban, Bi Weekly, Single Stream",{"$f":"'Collection Route Parameters'!B44","v":144}]
["Large Urban",50,"LONDON, CITY OF","N",{"$f":"VLOOKUP(B5,'2012 Program Data'!$B$30:$F$235,3,FALSE)","v":164390},{"$f":"VLOOKUP(B5,'2012 Program Data'!$B$6:$E$235,4,FALSE)","v":4178},168568,26669.900000000005,null,29336.890000000007,52,3.3468449619053538E-3,20,1229.5,1229.5,{"$f":"'Truck Assumptions'!$B$5/Municipalities!L5","v":1045.7610196581843},"run out of space",180.00000000000003,180.00000000000003,{"$f":"IF(Q5=\"run out of space\",((N5-P5)/'Collection Route Parameters'!$B$43)-'Collection Route Parameters'!$B$54,\"\")","v":0.35132766856564268},1109,{"$f":"ROUNDUP((G5/U5)/'Fuel and Labor Assumptions'!$B$7,0)","v":31},{"$f":"V5*'Truck Assumptions'!$B$16","v":1835933.8060866136},{"$f":"(V5*'Fuel and Labor Assumptions'!$B$5)*'Fuel and Labor Assumptions'!$B$6","v":465},24180,{"$f":"Y5*'Fuel and Labor Assumptions'!$B$4","v":1088100},{"$f":"(((U5*'Collection Route Parameters'!$B$7)*Municipalities!V5)/1000)+(M5*V5)","v":963.79},50117.08,{"$f":"AB5*'Truck Assumptions'!$B$10","v":52873.519399999997},{"$f":"AC5*'Fuel and Labor Assumptions'!$B$10","v":70321.780801999994},2994355.5868886136,{"$f":"VLOOKUP(B5,'2012 Macro Cost Data'!$B$5:$F$245,5,FALSE)","v":5084528.22},-2090172.6331113861,null,null,null,"Urban, Weekly, Dual Stream",{"$f":"'Collection Route Parameters'!B45","v":156.52173913043481}]
["Large Urban",97,"YORK, REGIONAL MUNICIPALITY OF","Y",{"$f":"VLOOKUP(B6,'2012 Program Data'!$B$30:$F$235,3,FALSE)","v":324702},{"$f":"VLOOKUP(B6,'2012 Program Data'!$B$6:$E$235,4,FALSE)","v":0},332788,76736.710000000006,50000,84410.381000000008,{"$f":"VLOOKUP(B6,'2012 Program Data'!$B$6:$T$235,19,FALSE)","v":52},4.8778097698604144E-3,20,{"$f":"IF(AND(D6=\"Y\",F6<1,K6=52),'Collection Route Parameters'!$B$31,IF(AND(D6=\"N\",F6<1,K6=52),'Collection Route Parameters'!$B$33,IF(AND(D155=\"Y\",F155<1,K155=26),'Collection Route Parameters'!$B$32,'Collection Route Parameters'!$B$34)))","v":1229.5},1085.8232782164955,{"$f":"'Truck Assumptions'!$B$5/Municipalities!L6","v":717.53515719825975},"run out of space",180.00000000000003,158.96558770147965,{"$f":"IF(Q6=\"run out of space\",((N6-P6)/'Collection Route Parameters'!$B$43)-'Collection Route Parameters'!$B$54,\"\")","v":2.1748046822318901},1109,{"$f":"ROUNDUP((G6/U6)/'Fuel and Labor Assumptions'!$B$7,0)","v":61},{"$f":"V6*'Truck Assumptions'!$B$16","v":3612643.9410091424},{"$f":"(V6*'Fuel and Labor Assumptions'!$B$5)*'Fuel and Labor Assumptions'!$B$6","v":915},47580,{"$f":"Y6*'Fuel and Labor Assumptions'!$B$4","v":2141100},{"$f":"(((U6*'Collection Route Parameters'!$B$7)*Municipalities!V6)/1000)+(M6*V6)","v":1896.49},98617.48,{"$f":"AB6*'Truck Assumptions'!$B$10","v":104041.4414},{"$f":"AC6*'Fuel and Labor Assumptions'!$B$10","v":138375.117062},5892119.0580711421,{"$f":"VLOOKUP(B6,'2012 Macro Cost Data'!$B$5:$F$245,5,FALSE)","v":9252969.9499999993},-3360850.8919288572,null,null,null,"Urban, Bi Weekly, Dual Stream",{"$f":"'Collection Route Parameters'!B46","v":124.13793103448276}]
["Large Urban",172,"HAMILTON, CITY OF","Y",{"$f":"VLOOKUP(B7,'2012 Program Data'!$B$30:$F$235,3,FALSE)","v":213903},{"$f":"VLOOKUP(B7,'2012 Program Data'!$B$6:$E$235,4,FALSE)","v":0},215733,38422.150000000009,60000,42264.365000000013,52,3.7675100703184038E-3,20,{"$f":"IF(AND(D7=\"Y\",F7<1,K7=52),'Collection Route Parameters'!$B$31,IF(AND(D7=\"N\",F7<1,K7=52),'Collection Route Parameters'!$B$33,IF(AND(D156=\"Y\",F156<1,K156=26),'Collection Route Parameters'!$B$32,'Collection Route Parameters'!$B$34)))","v":1229.5},963.53852601749998,{"$f":"'Truck Assumptions'!$B$5/Municipalities!L7","v":928.9955261364978},"run out of space",180.00000000000003,141.06298062883289,{"$f":"IF(Q7=\"run out of space\",((N7-P7)/'Collection Route Parameters'!$B$43)-'Collection Route Parameters'!$B$54,\"\")","v":1.0000248547972341},1109,{"$f":"ROUNDUP((G7/U7)/'Fuel and Labor Assumptions'!$B$7,0)","v":39},{"$f":"V7*'Truck Assumptions'!$B$16","v":2309723.1753992881},{"$f":"(V7*'Fuel and Labor Assumptions'!$B$5)*'Fuel and Labor Assumptions'!$B$6","v":585},30420,{"$f":"Y7*'Fuel and Labor Assumptions'!$B$4","v":1368900},{"$f":"(((U7*'Collection Route Parameters'!$B$7)*Municipalities!V7)/1000)+(M7*V7)","v":1212.51},63050.52,{"$f":"AB7*'Truck Assumptions'!$B$10","v":66518.298599999995},{"$f":"AC7*'Fuel and Labor Assumptions'!$B$10","v":88469.337138000003},3767092.512537288,{"$f":"VLOOKUP(B7,'2012 Macro Cost Data'!$B$5:$F$245,5,FALSE)","v":7922612.29},-4155519.777462712,null,null,null,"Rural, Weekly, Single Stream ",{"$f":"'Collection Route Parameters'!B47","v":144}]
["Large Urban",270,"PEEL, REGIONAL MUNICIPALITY OF","Y",{"$f":"VLOOKUP(B8,'2012 Program Data'!$B$30:$F$235,3,FALSE)","v":416500},{"$f":"VLOOKUP(B8,'2012 Program Data'!$B$6:$E$235,4,FALSE)","v":0},416500,86950.399999999994,96000,95645.440000000002,52,4.4161713916335771E-3,20,{"$f":"IF(AND(D8=\"Y\",F8<1,K8=52),'Collection Route Parameters'!$B$31,IF(AND(D8=\"N\",F8<1,K8=52),'Collection Route Parameters'!$B$33,IF(AND(D157=\"Y\",F157<1,K157=26),'Collection Route Parameters'!$B$32,'Collection Route Parameters'!$B$34)))","v":1229.5},1009.0854341736695,{"$f":"'Truck Assumptions'!$B$5/Municipalities!L8","v":792.54170402687237},"run out of space",180.00000000000003,147.73109243697482,{"$f":"IF(Q8=\"run out of space\",((N8-P8)/'Collection Route Parameters'!$B$43)-'Collection Route Parameters'!$B$54,\"\")","v":1.7581016442951531},1109,{"$f":"ROUNDUP((G8/U8)/'Fuel and Labor Assumptions'!$B$7,0)","v":76},{"$f":"V8*'Truck Assumptions'!$B$16","v":4500999.0084704077},{"$f":"(V8*'Fuel and Labor Assumptions'!$B$5)*'Fuel and Labor Assumptions'!$B$6","v":1140},59280,{"$f":"Y8*'Fuel and Labor Assumptions'!$B$4","v":2667600},{"$f":"(((U8*'Collection Route Parameters'!$B$7)*Municipalities!V8)/1000)+(M8*V8)","v":2362.84},122867.68000000001,{"$f":"AB8*'Truck Assumptions'!$B$10","v":129625.40240000001},{"$f":"AC8*'Fuel and Labor Assumptions'!$B$10","v":172401.78519200001},7341000.7936624084,{"$f":"VLOOKUP(B8,'2012 Macro Cost Data'!$B$5:$F$245,5,FALSE)","v":19937202.43},-12596201.636337591,null,null,null,"Rural, Bi Weekly, Single Stream",{"$f":"'Collection Route Parameters'!B48","v":120.00000000000003}]
{"$rows_left_out":227}
{"sheet":"2012 Program Data","index":5,"n_rows":241,"n_cols":25,"rows_kept":241,"cut":false,"hidden":false,"merged":[[3,3,3,5],[3,6,3,18],[3,19,3,20],[3,21,3,23]]}
[]
[null,"2012 Blue Box Program Data"]
[]
[null,null,null,"Blue Box Program",null,null,"Residential Blue Box Materials Collected (beyond 5 basic materials:  ONP (old newsprint), Glass, Aluminum Cans, Steel Cans, PET Plastic)",null,null,null,null,null,null,null,null,null,null,null,null,"Total Number of Collections Per Year for Curbside Blue Box Programs 2)",null,"Residential Pay As You Throw Program for Garbage Collection "]
[null,"Program Code","Program Title","Households Serviced by Curbside Collection 1)","Households Serviced by Depot Collection Only","Total # of Households Serviced","Corrugated Cardboard","Boxboard","Gable Top Cartons","Tetra Pak Cartons","Other Aluminum Packaging & Foil","Empty Aerosol Cans","Empty Paint Cans","HDPE Containers (#2)","Other Bottles & Containers (#3, #5, #7)","LDPE/HDPE film (#2, #4)","Tubs & Lids (#2, #4, & #5)","Polystyrene Foam(#6)","Polystyrene Crystal(#6)","Single Family Dwellings","Multi-Family Dwellings","User Pay Waste \nCollection / Pay as You Throw ","Partial User Pay","Full User Pay","Bag Limit Program for Garbage Collection"]
[null,521,"ADDINGTON HIGHLANDS, TOWNSHIP OF",2706,0,{"$f":"D6+E6","v":2706},"Y","Y","Y","Y","Y","Y","Y","Y","Y","Y","Y","Y","Y","N/A","N/A","Y","Y","N","N"]
[null,522,"ADMASTON/BROMLEY, TOWNSHIP OF",0,1336,1336,"Y","Y","Y","Y","Y","Y","Y","Y","Y","Y","Y","Y","Y","Depot","Depot","N","N","N","N"]
[null,600,"ALFRED & PLANTAGENET, TOWNSHIP OF",4146,0,4146,"Y","Y","Y","Y","Y","Y","Y","Y","Y","Y","Y","Y","Y","N/A","N/A","N","N","N","Y"]
{"$rows_left_out":234}
{"sheet":"2012 Macro Cost Data","index":6,"n_rows":257,"n_cols":17,"rows_kept":257,"cut":false,"hidden":false,"merged":[[246,2,250,13],[251,2,252,13]]}
[]
[null,"2012 Blue Box Financial Details"]
[]
["Municipal Grouping","Program Code","Program Name","Marketed or Calculated Marketed Tonnes","Single Stream","Residential Collection Costs","Residential Processing Costs ","Residential Depot/Transfer Costs","Residential Promotion & Education Costs","Interest on Municipal Capital","Adminstration Costs","Administration Factor (Calculated)","Calculated Administration1 and Interest on Municipal Capital2 ","Gross Costs ","Total Gross Revenue","Net Cost ","Net Cost per Tonne"]
[1,1,"HALTON, REGIONAL MUNICIPALITY OF",41298.58,"Y",5130395.68,3219575.71,48119.7,200371.68999999997,21475.35,310533.7,3.602504975288031E-2,332009.05,8930471.8299999982,1302216.6500000001,7628255.1799999978,184.70986605350589]
[1,172,"HAMILTON, CITY OF",38422.15,"N",7922612.29,3479644.93,124144.33,145501.86000000002,173053.91,394518.97,3.3306913595531638E-2,567572.88,12239476.290000001,4535360.72,7704115.5700000012,200.51234951714054]
[1,50,"LONDON, CITY OF",26669.9,"N",5084528.22,4153375.59,66046.289999999994,228337.97,268180.84999999998,332513,3.3928274525868309E-2,600693.85,10132981.919999998,3605121.89,6527860.0299999975,244.76507335985502]
[1,270,"PEEL, REGIONAL MUNICIPALITY OF",86950.399999999994,"Y",19937202.43,14095723.1,286940.40000000002,673487.78,943555.54,1242238.82,3.4567213650962485E-2,2185794.3600000003,37179148.07,9639556.459999999,27539591.609999999,316.72760113812012]
{"$rows_left_out":250}
{"sheet":"Look Up Table","index":7,"n_rows":37,"n_cols":6,"rows_kept":37,"cut":false,"hidden":false,"merged":[]}
[]
[]
[]
[]
["Collection Type/Stream","Municipal Band","ID Code","Households Collected in a Day","Households Collected in an hour","Distance Between Households"]
["Weekly Single Stream","Large Urban",41,{"$f":"'Collection Route Parameters'!I16","v":1167.7928480062408},{"$f":"'Collection Route Parameters'!I26","v":170.9660127215318},{"$f":"'Collection Route Parameters'!I2/1000","v":1.6824490966446802E-2}]
[null,"Urban Regional",42,{"$f":"'Collection Route Parameters'!I17","v":1352.5081839950872},{"$f":"'Collection Route Parameters'!I27","v":198.00851819366875},{"$f":"'Collection Route Parameters'!I3/1000","v":8.8362111449796499E-3}]
[null,"Medium Urban",43,{"$f":"'Collection Route Parameters'!I18","v":1127.1582713209484},{"$f":"'Collection Route Parameters'!I28","v":165.01707103519377},{"$f":"'Collection Route Parameters'!I4/1000","v":1.8933124235374393E-2}]
{"$rows_left_out":30}
{"sheet":"Distance Between Household Data","index":8,"n_rows":53,"n_cols":10,"rows_kept":53,"cut":false,"hidden":false,"merged":[]}
["Large Urban",null,"Urban Regional",null,"Medium Urban"]
["Toronto",2503000,"Essex Windsor",216470,"City of Barrie",128430,null,"Toronto",2503000,18.333333333333332]
["Wellesley Street East",6,"Riverside Drive West ",3,"Bell Street",12,null,"Peel",1159405,15.666666666666666]
["Lumsden Avenue",24,"Bridge Avenue",4,"Briar Road",20,null,"Hamilton",504560,12]
["Mt Pleasant Road ",25,"Huron Church Road",14,"McCarthy Court",15]
["Average",{"$f":"AVERAGE(B3:B5)","v":18.333333333333332},"Average",{"$f":"AVERAGE(D3:D5)","v":7},"Average",{"$f":"AVERAGE(F3:F5)","v":15.666666666666666}]
["Peel",1159405,"Waterloo",97475,"City of Guelph",114940,null,"Essex Windsor",216470,7]
["Madrid Crst ",26,"King Street ",7,"University Ave East",35,null,"Waterloo",97475,12.333333333333334]
{"$rows_left_out":46}
{"sheet":"Sheet3","index":9,"n_rows":40,"n_cols":8,"rows_kept":40,"cut":false,"hidden":false,"merged":[]}
["Municipalities","Weighted Average Distance Between Households"]
["Large Urban",{"$f":"'Distance Between Household Data'!B17","v":16.824490966446803}]
["Urban Regional",{"$f":"'Distance Between Household Data'!D17","v":8.8362111449796501}]
["Medium Urban",{"$f":"'Distance Between Household Data'!F17","v":18.933124235374393}]
["Small Urban",{"$f":"'Distance Between Household Data'!D35","v":14.309438679108165}]
["Rural Regional",{"$f":"'Distance Between Household Data'!B35","v":17.671934141888865}]
["Rural Collection - North",{"$f":"'Distance Between Household Data'!F35","v":25.862448922383585}]
["Rural Collection - South",{"$f":"'Distance Between Household Data'!B53","v":23.872692609622071}]
{"$rows_left_out":33}
{"sheet":"Sheet5","index":10,"n_rows":0,"n_cols":0,"rows_kept":0,"cut":false,"hidden":false,"merged":[]}