{"text_format":"1","workbook":"xlsx","n_sheets":9,"sheets":["Emission Factors","Raw PC Data","OES","Landfilling Emissions","Virgin Emissions","Recycling Coefficient","OES Cost Data","Sheet1","Virgin Emissions Calculations"],"not_rendered":{"charts":2,"images":6,"macros":1,"external_links":7,"defined_names":543,"comments":6,"pivot_tables":0},"unopened":[],"bounds":{"document_bytes":16777216,"sheet_cells":100000,"rows_first":2000,"rows_last":500,"rows_between":2000,"halvings":0,"cell_chars":16384,"cell_head_chars":4096},"cells_cut":0,"cells_raw":0,"read":"whole","date_system":"1900"}

{"sheet":"Emission Factors","index":0,"n_rows":24,"n_cols":79,"rows_kept":24,"cut":false,"hidden":false,"merged":[[3,75,3,78],[3,45,3,50],[3,51,3,55],[3,56,3,60],[3,61,3,65],[3,66,3,69],[3,70,3,74],[2,70,2,74],[2,75,2,78],[3,1,3,4],[3,5,3,10],[3,11,3,16],[3,17,3,22],[3,23,3,28],[3,29,3,33],[3,34,3,38],[3,39,3,44],[2,39,2,44],[2,45,2,50],[2,51,2,55],[2,56,2,60],[2,61,2,65],[2,66,2,69],[1,2,1,4],[1,18,1,22],[1,39,1,44],[2,1,2,4],[2,5,2,10],[2,11,2,16],[2,17,2,22],[2,23,2,28],[2,29,2,33],[2,34,2,38]]}
["Final Emission Factors and their Components"]
[]
[null,"Source Reduction",null,null,null,"BASELINE\nRecycling of Post-Consumer Material",null,null,null,null,null,"ALTERNATIVE\nRecycling of Post-Consumer Material",null,null,null,null,null,"BASELINE\nCentralized Composting of Post-Consumer Material",null,null,null,null,null,"ALTERNATIVE\nCentralized Composting of Post-Consumer Material",null,null,null,null,null,"BASELINE\nAnaerobic Digestion of Post-Consumer Material",null,null,null,null,"ALTERNATIVE\nAnaerobic Digestion of Post-Consumer Material",null,null,null,null,"BASELINE\nCombustion of Post-Consumer Material",null,null,null,null,null,"ALTERNATIVE\nCombustion of Post-Consumer Material",null,null,null,null,null,"BASELINE\nLandfilling of Post-Consumer Material",null,null,null,null,"ALTERNATIVE\nLandfilling of Post-Consumer Material",null,null,null,null,"GHG Emissions of MSW Management Options Compared to Landfilling",null,null,null,null,"Product Manufacture Using 100% Virgin Inputs",null,null,null,"Product Manufacture Using Current Mix of Virgin and Recycled Inputs",null,null,null,null,"Product Manufacture Using 100% Recycled Inputs"]
[null,"(tonnes eCO2/tonne)",null,null,null,"(tonnes eCO2/tonne)",null,null,null,null,null,"(tonnes eCO2/tonne)",null,null,null,null,null,"(tonnes eCO2/tonne)",null,null,null,null,null,"(tonnes eCO2/tonne)",null,null,null,null,null,"(tonnes eCO2/tonne)",null,null,null,null,"(tonnes eCO2/tonne)",null,null,null,null,"(tonnes eCO2/tonne)",null,null,null,null,null,"(tonnes eCO2/tonne)",null,null,null,null,null,"(tonnes eCO2/tonne)",null,null,null,null,"(tonnes eCO2/tonne)",null,null,null,null,"(tonnes eCO2/tonne)",null,null,null,null,"(tonnes eCO2/tonne)",null,null,null,"(tonnes eCO2/tonne)",null,null,null,null,"(tonnes eCO2/tonne)"]
[null,"Manufacturing","Post-Consumer","Forest Carbon Sequestration","Net Emissions","Raw Materials Acquisition","Recycled Input Credit - Process Energy","Recycled Input Credit - Transport Energy","Recycled Input Credit - Process Non-energy","Forest Carbon Sequestration","Net Emissions (Post-Consumer)","Raw Materials Acquisition","Recycled Input Credit - Process Energy","Recycled Input Credit - Transport Energy","Recycled Input Credit - Process Non-energy","Forest Carbon Sequestration","Net Emissions (Post-Consumer)","Transportation to Compost Facility","Manufacturing","Compost Equipment CO2","Compost CH4","Soil Carbon Sequestration","Net Emissions (Post-Consumer)","Transportation to Compost Facility","Manufacturing","Compost Equipment CO2","Compost CH4","Soil Carbon Sequestration","Net Emissions (Post-Consumer)","Transportation to Digestion  Facility Energy","Anaerobic Digestion CH4","Avoided Utility Emissions","Soil Carbon Sequestration","Net Emissions (Post-Consumer)","Transportation to Digestion  Facility Energy","Anaerobic Digestion CH4","Avoided Utility Emissions","Soil Carbon Sequestration","Net Emissions (Post-Consumer)","Transportation to Combustion Facility Energy","CO2 from Combustion","N2O from Combustion","Avoided Utility Emissions","Steel Recovery","Net Emissions (Post-Consumer)","Transportation to Combustion Facility Energy","CO2 from Combustion","N2O from Combustion","Avoided Utility Emissions","Steel Recovery","Net Emissions (Post-Consumer)","Waste Collection and Transportation, Landfill Heavy Equipment, Energy Use at Waste Management Facilities","Net Landfill CH4","Avoided Utility Emissions","Landfill Carbon Sequestration","Net Emissions (Post-Consumer)","Waste Collection and Transportation, Landfill Heavy Equipment, Energy Use at Waste Management Facilities","Net Landfill CH4","Avoided Utility Emissions","Landfill Carbon Sequestration","Net Emissions (Post-Consumer)","Source Reduction Net Emissions Minus Landfilling Net Emissions","Recycling Net Emissions Minus Landfilling Net Emissions","Composting Net Emissions Minus Landfilling Net Emissions","Anaerobic Digestion Net Emissions Minus Landfilling Net Emissions","Combustion Net Emissions Minus Landfilling Net Emissions","Process Energy","Transportation Energy","Process Non-Energy","Net Emissions","Percent of Virgin in Current Mix","Process Energy","Transportation Energy","Process Non-Energy","Net Emissions","Process Energy","Transportation Energy","Process Non-Energy","Net Emissions"]
["Newsprint",{"$f":"IF(CurrentorVirgin=\"current\",-BW6,-BR6)","v":-0.94570751646678897},0,{"$f":"IF(CurrentorVirgin=\"Current\",-'[1]Forest C'!P4,-'[1]Forest C'!H4)","v":-3.0555555555555554},{"$f":"B6+C6+D6","v":-4.0012630720223443},{"$f":"'[1]Assumptions '!$C$65","v":5.9999999999999995E-4},{"$f":"('[1]Assumptions '!C100*'[1]Loss Rates'!D4*(BX6-BO6))+('[1]Assumptions '!D100*'[1]Loss Rates'!D5*(BX7-BO7))","v":-0.28395643437334506},{"$f":"('[1]Assumptions '!C100*'[1]Loss Rates'!D4*(BY6-BP6))+('[1]Assumptions '!D100*'[1]Loss Rates'!D5*(BY7-BP7))+([1]Settings!$H$26)","v":-1.396419992496957E-2},{"$f":"('[1]Assumptions '!C100*'[1]Loss Rates'!D4*(BZ6-BQ6))+('[1]Assumptions '!D100*'[1]Loss Rates'!D5*(BZ7-BQ7))","v":0},{"$f":"IF([1]Settings!$I$12=1,('[1]Assumptions '!C100*-'[1]Forest C'!M4)+'[1]Assumptions '!D100*-'[1]Forest C'!M5,0)","v":-2.4549204166666665},{"$f":"F6+G6+H6+I6+J6","v":-2.7522410509649813},{"$f":"'[1]Assumptions '!$C$65","v":5.9999999999999995E-4},{"$f":"('[1]Assumptions '!C100*'[1]Loss Rates'!D4*(BX6-BO6))+('[1]Assumptions '!D100*'[1]Loss Rates'!D5*(BX7-BO7))","v":-0.28395643437334506},{"$f":"('[1]Assumptions '!C100*'[1]Loss Rates'!D4*(BY6-BP6))+('[1]Assumptions '!D100*'[1]Loss Rates'!D5*(BY7-BP7))+([1]Settings!$I$26)","v":-1.396419992496957E-2},{"$f":"('[1]Assumptions '!C100*'[1]Loss Rates'!D4*(BZ6-BQ6))+('[1]Assumptions '!D100*'[1]Loss Rates'!D5*(BZ7-BQ7))","v":0},{"$f":"IF([1]Settings!$I$12=1,('[1]Assumptions '!C100*-'[1]Forest C'!M4)+'[1]Assumptions '!D100*-'[1]Forest C'!M5,0)","v":-2.4549204166666665},{"$f":"L6+M6+N6+O6+P6","v":-2.7522410509649813},"NA","NA","NA","NA","NA","NA","NA","NA","NA","NA","NA","NA",{"$f":"IF(ISBLANK('[1]User Assumptions'!$G$58),[1]Landfill!$J$36,([1]Settings!$H$28+[1]Landfill!$J$36))","v":0.01},{"$f":"'[1]AD CH4'!Z5","v":0},{"$f":"'[1]Electricity Offsets'!F127","v":-0.11862778196164922},{"$f":"IF([1]Settings!$I$12=1,-'[1]AD Soil C'!N12,0)","v":-0.38533333886554794},{"$f":"AD6+AE6+AF6+AG6","v":-0.49396112082719718},{"$f":"IF(ISBLANK('[1]User Assumptions'!$J$58),[1]Landfill!$J$36,([1]Settings!$I$28+[1]Landfill!$J$36))","v":0.01},{"$f":"'[1]AD CH4'!Z5","v":0},{"$f":"'[1]Electricity Offsets'!F127","v":-0.11862778196164922},{"$f":"IF([1]Settings!$I$12=1,-'[1]AD Soil C'!N12,0)","v":-0.38533333886554794},{"$f":"AI6+AJ6+AK6+AL6","v":-0.49396112082719718},{"$f":"IF(ISBLANK('[1]User Assumptions'!$G$59),[1]Landfill!$J$36,([1]Settings!$H$29+[1]Landfill!$J$36))","v":0.01},{"$f":"'[1]Comb CO2&N2O'!G6","v":0},{"$f":"'[1]Comb CO2&N2O'!H6","v":3.7200000000000004E-2},{"$f":"IF([1]Settings!$B$24=1,'[1]Electricity Offsets'!I26,0)","v":-0.1014192609005326},0,{"$f":"AN6+AO6+AP6+AQ6+AR6","v":-5.4219260900532598E-2},{"$f":"IF(ISBLANK('[1]User Assumptions'!$J$59),[1]Landfill!$J$36,([1]Settings!$I$29+[1]Landfill!$J$36))","v":0.01},{"$f":"'[1]Comb CO2&N2O'!G6","v":0},{"$f":"'[1]Comb CO2&N2O'!H6","v":3.7200000000000004E-2},{"$f":"IF([1]Settings!$D$24=1,'[1]Electricity Offsets'!I26,0)","v":-0.1014192609005326},0,{"$f":"AT6+AU6+AV6+AW6+AX6","v":-5.4219260900532598E-2},{"$f":"IF(ISBLANK('[1]User Assumptions'!$G$60),[1]Landfill!$M$36,([1]Settings!$H$30+[1]Landfill!$M$36))","v":1.4749999999999999E-2},{"$f":"[1]Landfill!AC12","v":0.21621694499999999},{"$f":"IF([1]Settings!$B$13=1,'[1]Electricity Offsets'!L100,IF([1]Settings!$B$6=1,'[1]Electricity Offsets'!K100,0))","v":-1.2515481809855556E-3},{"$f":"IF([1]Settings!$I$12=1,-[1]Landfill!G36,0)","v":-1.4475999999999998},{"$f":"AZ6+BA6+BB6+BC6","v":-1.2178846031809853},{"$f":"IF(ISBLANK('[1]User Assumptions'!$J$60),[1]Landfill!$M$36,([1]Settings!$I$30+[1]Landfill!$M$36))","v":1.4749999999999999E-2},{"$f":"[1]Landfill!AC44","v":0.21621694499999999},{"$f":"IF([1]Settings!$D$13=1,'[1]Electricity Offsets'!L100,IF([1]Settings!$D$6=1,'[1]Electricity Offsets'!K100,0))","v":-1.2515481809855556E-3},{"$f":"IF([1]Settings!$I$12=1,-[1]Landfill!G36,0)","v":-1.4475999999999998},{"$f":"BE6+BF6+BG6+BH6","v":-1.2178846031809853},{"$f":"E6-BD6","v":-2.783378468841359},{"$f":"K6-BD6","v":-1.5343564477839959},"NA",{"$f":"AH6-BD6","v":0.72392348235378812},{"$f":"AS6-BD6","v":1.1636653422804528},{"$f":"'[1]Energy Data'!T3","v":0.89370753014739568},{"$f":"'[1]Energy Data'!AO3","v":5.1999986319393253E-2},0,{"$f":"BO6+BP6+BQ6","v":0.94570751646678897},{"$f":"'[1]Mixed Recyc'!K4","v":0.8056102896495847},{"$f":"BO6*BS6+(1-BS6)*BX6","v":0.82402742072685775},{"$f":"BS6*BP6+(1-BS6)*BY6","v":4.848912419614998E-2},{"$f":"BS6*BQ6+(1-BS6)*BZ6","v":0},{"$f":"BT6+BU6+BV6","v":0.87251654492300768},{"$f":"'[1]Energy Data'!T19","v":0.53525178012374708},{"$f":"'[1]Energy Data'!AO19","v":3.3939040002253097E-2},0,{"$f":"BX6+BY6+BZ6","v":0.5691908201260002}]
{"$rows_left_out":19}
{"sheet":"Raw PC Data","index":1,"n_rows":191,"n_cols":53,"rows_kept":191,"cut":false,"hidden":false,"merged":[[18,21,18,39],[3,21,3,39],[44,21,44,39],[75,2,75,10],[75,11,75,19],[76,11,76,13],[35,21,35,39],[55,21,55,39],[76,2,76,4],[74,1,74,4],[75,20,75,28],[75,29,75,37],[76,35,76,37],[76,20,76,22],[76,14,76,16],[76,23,76,25],[76,17,76,19],[76,32,76,34],[76,5,76,7],[76,8,76,10],[77,35,77,37],[77,26,77,28],[89,14,89,16],[89,17,89,19],[89,20,89,22],[77,20,77,22],[89,23,89,25],[77,23,77,25],[88,23,88,25],[77,29,77,31],[77,32,77,34],[87,29,87,37],[77,17,77,19],[87,20,87,28],[88,26,88,28],[89,2,89,4],[89,5,89,7],[89,8,89,10],[89,11,89,13],[64,21,64,39],[76,26,76,28],[89,26,89,28],[88,14,88,16],[88,17,88,19],[88,35,88,37],[89,29,89,31],[89,32,89,34],[89,35,89,37],[88,29,88,31],[88,32,88,34],[76,29,76,31],[88,2,88,4],[88,5,88,7],[88,8,88,10],[88,11,88,13],[88,20,88,22],[86,1,86,4],[87,2,87,10],[87,11,87,19],[77,2,77,4],[77,5,77,7],[77,8,77,10],[77,11,77,13],[77,14,77,16]]}
["Raw PC/Electronics Data "]
[]
[null,"PC material data (100 percent virgin ) Franklin & Associates (2002)",null,null,null,null,null,null,null,null,null,null,null,null,null,null,null,null,null,null,null,null,null,null,null,null,null,null,null,null,null,null,null,null,null,null,null,null,null,null,null,null,"Composite Process Energy Factors (GJ/tonne)",null,null,null,null,null,"Composite Process Emission Factors (MTCO2E/tonne)"]
[null,"Process Energy for Materials in PC's (GJ/Tonne)",null,null,null,null,null,null,null,null,null,null,null,null,null,null,null,null,null,null,null,"CO2 Emissions from Process Energy for Materials in PC's (Tonne eCO2 per Tonne Output)",null,null,null,null,null,null,null,null,null,null,null,null,null,null,null,null,null,null,null,null,null,"PC & Monitor1 ","Televisions2 ","Microwaves3 ","VCRs4 ",null,null,"PC & Monitor1 ","Televisions2 ","Microwaves3 ","VCRs4 "]
[null,"Material Type \n(Virgin inputs)","Delivered Electricity","Coal ","Natural Gas","Kerosene & Stove Oil","Nat Gas feedstock (other fuels)","Oils feedstock","Diesel","LPG","Distillate (Light Fuel Oil)","Residual (Heavy Fuel Oil)","Gasoline","Oil/ Lubricants","Petroleum (Non-specified)","Biomass","Hydro","Nuclear","Other","Total",null,"Material Type \n(Virgin inputs)","Delivered Electricity","Coal ","Natural Gas","Kerosene & Stove Oil","Nat Gas feedstock (other fuels)","Oils feedstock","Diesel","LPG","Distillate (Light Fuel Oil)","Residual (Heavy Fuel Oil)","Gasoline","Oil/ Lubricants","Petroleum (Non-specified)","Biomass","Hydro","Nuclear","Other","Total",null,null,null,"Average","\"B&O 28\"\"","Average","Average",null,null,"Average","\"B&O 28\"\"","Average","Average"]
[null,"Copper",{"$f":"'[3]Energy Data Conversion'!C3","v":22.244317131212117},{"$f":"'[3]Energy Data Conversion'!D3","v":3.2068579242424238},{"$f":"'[3]Energy Data Conversion'!E3","v":41.935834393939395},{"$f":"'[3]Energy Data Conversion'!F3","v":0},{"$f":"'[3]Energy Data Conversion'!G3","v":0},{"$f":"'[3]Energy Data Conversion'!H3","v":0},{"$f":"'[3]Energy Data Conversion'!I3","v":15.420405389999999},{"$f":"'[3]Energy Data Conversion'!J3","v":2.3660268245454544E-2},{"$f":"'[3]Energy Data Conversion'!K3","v":1.0994941454545453},{"$f":"'[3]Energy Data Conversion'!L3","v":8.7043286515151514},{"$f":"'[3]Energy Data Conversion'!M3","v":0.3982142257575757},{"$f":"'[3]Energy Data Conversion'!N3","v":0},{"$f":"'[3]Energy Data Conversion'!O3","v":0},{"$f":"'[3]Energy Data Conversion'!P3","v":0},{"$f":"'[3]Energy Data Conversion'!Q3","v":7.048039393939394E-2},{"$f":"'[3]Energy Data Conversion'!R3","v":0.42288236363636361},{"$f":"'[3]Energy Data Conversion'!S3","v":5.9908334848484839E-2},{"$f":"'[3]Energy Data Conversion'!T3","v":93.586383222790886},null,"Copper",{"$f":"C6*'[1]Electricity Coefficients'!$C$20","v":1.4259376822051113},{"$f":"D6*'[1]Carbon Coeffficients'!$I$5","v":0.29897209694924082},{"$f":"E6*'[1]Carbon Coeffficients'!$I$6","v":2.5245538298007184},{"$f":"F6*'[1]Carbon Coeffficients'!$I$7","v":0},{"$f":"G6*'[1]Carbon Coeffficients'!$I$8","v":0},{"$f":"H6*'[1]Carbon Coeffficients'!$I$9","v":0},{"$f":"I6*'[1]Carbon Coeffficients'!$I$10","v":1.3925355696866433},{"$f":"J6*'[1]Carbon Coeffficients'!$I$11","v":1.8541496554267606E-3},{"$f":"K6*'[1]Carbon Coeffficients'!$I$12","v":0.1042594251942207},{"$f":"L6*'[1]Carbon Coeffficients'!$I$13","v":0.827752413180604},{"$f":"M6*'[1]Carbon Coeffficients'!$I$14","v":3.5476753341541496E-2},{"$f":"N6*'[1]Carbon Coeffficients'!$I$15","v":0},{"$f":"O6*'[1]Carbon Coeffficients'!$I$16","v":0},{"$f":"P6*'[1]Carbon Coeffficients'!$I$17","v":0},{"$f":"Q6*'[1]Carbon Coeffficients'!$I$18","v":0},{"$f":"R6*'[1]Carbon Coeffficients'!$I$19","v":0},{"$f":"S6*'[1]Carbon Coeffficients'!$I$20","v":0},{"$f":"SUM(W6:AM6)","v":6.6113419200135066},null,null,"Copper",{"$f":"$T6*J151","v":6.4846004935071813},1.9725467189815409,8.2334061486326284,10.294502154506997,null,"Copper",{"$f":"$AN6*J151","v":0.45809988163773591},0.13934912711972261,0.58164298416541105,0.72724761120148573]
{"$rows_left_out":186}
{"sheet":"OES","index":2,"n_rows":48,"n_cols":17,"rows_kept":48,"cut":false,"hidden":false,"merged":[[43,4,43,6],[3,1,3,2]]}
["INDIVIDUAL MATERIAL INPUTS"]
["CELLS WITH SHADED PATTERN WILL BE LOCKED IN LATER VERSIONS"]
[]
["Material","Tonnage Data",null,"Gross Costs","Material Management Costs","Recycling Emissions Coefficients (GHD)","Landfilling Emissions Coeffcient (Canadian WARM)","Virgins Emissions Coeffcient (Canadian WARM)","Recycling Rates","Avoided Emissions","Potential Credit","$/tC02 avoided","Relative Contribution of Cost Component Categories"]
[null,"Generation (Year 5 Tonnes)\n(Sheet 1)","Recovery\n(Sheet 1)","($/tonne)","($s)","tCO2e/tonne","tCO2e/tonne","tCO2e/tonne","(%)","tCO2e","$","$/tCO2e","Collection","Consolidation","Processing","Transportation","Contingency"]
[null,"(tonnes)","(tonnes)",null,null,null,null,null,null,null,null,null,{"$f":"'OES Cost Data'!B59","v":0.19245178998014711},{"$f":"'OES Cost Data'!C59","v":2.3498368082515229E-2},{"$f":"'OES Cost Data'!D59","v":0.56268961234753534},{"$f":"'OES Cost Data'!E59","v":0.13026976390322489},{"$f":"'OES Cost Data'!F59","v":9.1090465686577429E-2}]
{"$rows_left_out":43}
{"sheet":"Landfilling Emissions","index":3,"n_rows":78,"n_cols":21,"rows_kept":78,"cut":false,"hidden":false,"merged":[]}
["Material Code","Material","California EPA","Canadian Warm adapted by GDL","ICF Report (2005)","USEPA WARM"," Greenhouse Gases Calculator for Waste Management"]
[null,null,"tCO2e/tonne","tCO2e/tonne","tCO2e/tonne","tCO2e/tonne","tCO2e/tonne"]
[]
[1,"Newsprint - CNA/OCNA",3.4,1.9281999999999999,2.75,2.75,2.4900000000000002]
[1,"Newsprint - Non-CNA/OCNA",3.4,1.9281999999999999,2.75,2.75,2.4900000000000002]
[2,"Magazines and Catalogues",0.3,2.3595000000000002,"NA",3.07,2.9]
{"$rows_left_out":73}
{"sheet":"Virgin Emissions","index":4,"n_rows":38,"n_cols":18,"rows_kept":38,"cut":false,"hidden":false,"merged":[]}
[null,"Material","*Using CAD WARM Data as Analog\"","USEPA WARM CALCULATOR",3,4]
[]
[null,null,"Television"]
[null,"Computer Monitors",{"$f":"'Emission Factors'!$BW$21","v":3.2279887402181937}]
[null,"Display Devices <18\"",{"$f":"'Emission Factors'!$BW$21","v":3.2279887402181937}]
[null,"Display Devices 18-29\"",{"$f":"'Emission Factors'!$BW$21","v":3.2279887402181937}]
{"$rows_left_out":33}
{"sheet":"Recycling Coefficient","index":5,"n_rows":83,"n_cols":8,"rows_kept":83,"cut":false,"hidden":false,"merged":[]}
["Material Code","Material","California EPA","Canadian Warm adapted by GDL","ICF Report (2005)","ICR Report (2005) *Without Carbon Sinks","USEPA WARM"," Greenhouse Gases Calculator for Waste Management"]
[null,null,"tCO2e/tonne","tCO2e/tonne","tCO2e/tonne","tCO2e/tonne","tCO2e/tonne","tCO2e/tonne"]
[null,null,"(tonnes)"]
[1,"Newsprint - CNA/OCNA",3.4,1.9281999999999999,2.75,0.3,2.75,2.4900000000000002]
[1,"Newsprint - Non-CNA/OCNA",3.4,1.9281999999999999,2.75,0.3,2.75,2.4900000000000002]
[2,"Magazines and Catalogues",0.3,2.3595000000000002,"NA","NA",3.07,2.9]
{"$rows_left_out":78}
{"sheet":"OES Cost Data","index":6,"n_rows":59,"n_cols":9,"rows_kept":59,"cut":false,"hidden":false,"merged":[]}
[null,"Collection","Consolidation","Processing","Transportation","Contingency","Total Management Cost"]
["Computer Monitors - Direct Ship",{"$f":"SUM(B35:B36)/$I$35","v":294.81720636137192},35.997125886185096,999.9225905345852,217.08354090821996,154.78214217283005,1702.6026058631921]
["Computer Monitors - Approved Collection"]
["Displays <18",{"$f":"B37/$I37","v":327.72127139364301},40.01466992665037,1000.3691931540342,217.18092909535451,158.52811735941322,1743.8141809290953]
["Displays 18-29",{"$f":"B38/$I38","v":327.60172143974961},40.000195618153363,1000.0053794992175,217.10152582159625,{"$f":"F38/$I38","v":158.47085289514868},{"$f":"G38/$I38","v":1743.1796752738653}]
["Displays >29-45",327.60837438423647,40.000985221674874,1000.0253694581281,217.10591133004925,159.21305418719211,1743.9536945812808]
{"$rows_left_out":54}
{"sheet":"Sheet1","index":7,"n_rows":28,"n_cols":12,"rows_kept":28,"cut":false,"hidden":false,"merged":[[3,1,3,2]]}
["INDIVIDUAL MATERIAL INPUTS"]
["CELLS WITH SHADED PATTERN WILL BE LOCKED IN LATER VERSIONS"]
[]
["Material","Tonnage Data",null,"Gross Costs","Material Management Costs","Recycling Emissions Coefficients (GHD)","Landfilling Emissions Coeffcient (Canadian WARM)","Virgins Emissions Coeffcient (Canadian WARM)","Recycling Rates","Avoided Emissions","Potential Credit","$/tC02 avoided"]
[null,"Generation (Year 5 Tonnes)\n(Sheet 1)","Recovery\n(Sheet 1)","($/tonne)","($s)","tCO2e/tonne","tCO2e/tonne","tCO2e/tonne","(%)","tCO2e","$","$/tCO2e"]
[null,"(tonnes)","(tonnes)"]
{"$rows_left_out":23}
{"sheet":"Virgin Emissions Calculations","index":8,"n_rows":191,"n_cols":53,"rows_kept":191,"cut":false,"hidden":false,"merged":[[64,21,64,39],[3,21,3,39],[18,21,18,39],[35,21,35,39],[44,21,44,39],[55,21,55,39],[76,2,76,4],[76,5,76,7],[76,8,76,10],[76,11,76,13],[76,14,76,16],[74,1,74,4],[75,2,75,10],[75,11,75,19],[75,20,75,28],[75,29,75,37],[76,35,76,37],[77,2,77,4],[77,5,77,7],[77,8,77,10],[77,11,77,13],[77,14,77,16],[77,17,77,19],[77,20,77,22],[77,23,77,25],[77,26,77,28],[76,17,76,19],[76,20,76,22],[76,23,76,25],[76,26,76,28],[76,29,76,31],[76,32,76,34],[77,29,77,31],[77,32,77,34],[77,35,77,37],[86,1,86,4],[87,2,87,10],[87,11,87,19],[87,20,87,28],[87,29,87,37],[88,35,88,37],[88,2,88,4],[88,5,88,7],[88,8,88,10],[88,11,88,13],[88,14,88,16],[88,17,88,19],[88,20,88,22],[88,23,88,25],[88,26,88,28],[88,29,88,31],[88,32,88,34],[89,35,89,37],[89,2,89,4],[89,5,89,7],[89,8,89,10],[89,11,89,13],[89,14,89,16],[89,17,89,19],[89,20,89,22],[89,23,89,25],[89,26,89,28],[89,29,89,31],[89,32,89,34]]}
["Raw PC/Electronics Data "]
[]
[null,"PC material data (100 percent virgin ) Franklin & Associates (2002)",null,null,null,null,null,null,null,null,null,null,null,null,null,null,null,null,null,null,null,null,null,null,null,null,null,null,null,null,null,null,null,null,null,null,null,null,null,null,null,null,"Composite Process Energy Factors (GJ/tonne)",null,null,null,null,null,"Composite Process Emission Factors (MTCO2E/tonne)"]
[null,"Process Energy for Materials in PC's (GJ/Tonne)",null,null,null,null,null,null,null,null,null,null,null,null,null,null,null,null,null,null,null,"CO2 Emissions from Process Energy for Materials in PC's (Tonne eCO2 per Tonne Output)",null,null,null,null,null,null,null,null,null,null,null,null,null,null,null,null,null,null,null,null,null,"PC & Monitor1 ","Televisions2 ","Microwaves3 ","VCRs4 ",null,null,"PC & Monitor1 ","Televisions2 ","Microwaves3 ","VCRs4 "]
[null,"Material Type \n(Virgin inputs)","Delivered Electricity","Coal ","Natural Gas","Kerosene & Stove Oil","Nat Gas feedstock (other fuels)","Oils feedstock","Diesel","LPG","Distillate (Light Fuel Oil)","Residual (Heavy Fuel Oil)","Gasoline","Oil/ Lubricants","Petroleum (Non-specified)","Biomass","Hydro","Nuclear","Other","Total",null,"Material Type \n(Virgin inputs)","Delivered Electricity","Coal ","Natural Gas","Kerosene & Stove Oil","Nat Gas feedstock (other fuels)","Oils feedstock","Diesel","LPG","Distillate (Light Fuel Oil)","Residual (Heavy Fuel Oil)","Gasoline","Oil/ Lubricants","Petroleum (Non-specified)","Biomass","Hydro","Nuclear","Other","Total",null,null,null,"Average","\"B&O 28\"\"","Average","Average",null,null,"Average","\"B&O 28\"\"","Average","Average"]
[null,"Copper",{"$f":"'[3]Energy Data Conversion'!C3","v":22.244317131212117},{"$f":"'[3]Energy Data Conversion'!D3","v":3.2068579242424238},{"$f":"'[3]Energy Data Conversion'!E3","v":41.935834393939395},{"$f":"'[3]Energy Data Conversion'!F3","v":0},{"$f":"'[3]Energy Data Conversion'!G3","v":0},{"$f":"'[3]Energy Data Conversion'!H3","v":0},{"$f":"'[3]Energy Data Conversion'!I3","v":15.420405389999999},{"$f":"'[3]Energy Data Conversion'!J3","v":2.3660268245454544E-2},{"$f":"'[3]Energy Data Conversion'!K3","v":1.0994941454545453},{"$f":"'[3]Energy Data Conversion'!L3","v":8.7043286515151514},{"$f":"'[3]Energy Data Conversion'!M3","v":0.3982142257575757},{"$f":"'[3]Energy Data Conversion'!N3","v":0},{"$f":"'[3]Energy Data Conversion'!O3","v":0},{"$f":"'[3]Energy Data Conversion'!P3","v":0},{"$f":"'[3]Energy Data Conversion'!Q3","v":7.048039393939394E-2},{"$f":"'[3]Energy Data Conversion'!R3","v":0.42288236363636361},{"$f":"'[3]Energy Data Conversion'!S3","v":5.9908334848484839E-2},{"$f":"'[3]Energy Data Conversion'!T3","v":93.586383222790886},null,"Copper",{"$f":"C6*'[2]Electricity Coefficients'!$C$20","v":1.4259376822051113},{"$f":"D6*'[2]Carbon Coeffficients'!$I$5","v":0.29897209694924082},{"$f":"E6*'[2]Carbon Coeffficients'!$I$6","v":2.5245538298007184},{"$f":"F6*'[2]Carbon Coeffficients'!$I$7","v":0},{"$f":"G6*'[2]Carbon Coeffficients'!$I$8","v":0},{"$f":"H6*'[2]Carbon Coeffficients'!$I$9","v":0},{"$f":"I6*'[2]Carbon Coeffficients'!$I$10","v":1.3925355696866433},{"$f":"J6*'[2]Carbon Coeffficients'!$I$11","v":1.8541496554267606E-3},{"$f":"K6*'[2]Carbon Coeffficients'!$I$12","v":0.1042594251942207},{"$f":"L6*'[2]Carbon Coeffficients'!$I$13","v":0.827752413180604},{"$f":"M6*'[2]Carbon Coeffficients'!$I$14","v":3.5476753341541496E-2},{"$f":"N6*'[2]Carbon Coeffficients'!$I$15","v":0},{"$f":"O6*'[2]Carbon Coeffficients'!$I$16","v":0},{"$f":"P6*'[2]Carbon Coeffficients'!$I$17","v":0},{"$f":"Q6*'[2]Carbon Coeffficients'!$I$18","v":0},{"$f":"R6*'[2]Carbon Coeffficients'!$I$19","v":0},{"$f":"S6*'[2]Carbon Coeffficients'!$I$20","v":0},{"$f":"SUM(W6:AM6)","v":6.6113419200135066},null,null,"Copper",{"$f":"$T6*J151","v":6.4846004935071813},1.9725467189815409,8.2334061486326284,10.294502154506997,null,"Copper",{"$f":"$AN6*J151","v":0.45809988163773591},0.13934912711972261,0.58164298416541105,0.72724761120148573]
{"$rows_left_out":185}