{"text_format":"1","workbook":"xlsx","n_sheets":7,"sheets":["Inputs","Additional Info","Growth Trends","Sheet10","2012 Macro Cost Data","2012 BB Tonnes (2)","2012 BB Category Details"],"not_rendered":{"charts":1,"images":0,"macros":1,"external_links":0,"defined_names":93,"comments":0,"pivot_tables":0},"unopened":[],"bounds":{"document_bytes":16777216,"sheet_cells":100000,"rows_first":2000,"rows_last":500,"rows_between":2000,"halvings":0,"cell_chars":16384,"cell_head_chars":4096},"cells_cut":0,"cells_raw":0,"read":"whole","date_system":"1900"}

{"sheet":"Inputs","index":0,"n_rows":54,"n_cols":15,"rows_kept":54,"cut":false,"hidden":false,"merged":[[36,0,36,10]]}
["INPUTS"]
[]
[]
["Municipal Grouping","Generation","Marketed or Calculated Marketed Tonnes","Recycling Rate","Residential Collection Costs","Residential Processing Costs ","Residential Depot/Transfer Costs","Residential Promotion & Education Costs","Interest on Municipal Capital","Admin Costs","Gross Costs ","Total Gross Revenue","Net Cost (per tonne)"]
["Large Urban",674290.81166876724,426542.74000000005,{"$f":"C5/B5","v":0.63257978993421493},188.82900895230333,137.13791914498415,24.812653006355234,7.9746319442689364,8.8360709644243371,13.887155974100038,381.47743998643602,103.89206795548787,{"$f":"K5-L5","v":277.58537203094818}]
["Urban Regional",315332.68913048855,229743.24,{"$f":"C6/B6","v":0.72857413112958103},197.18015703095332,96.723754396429698,2.6296030298867556,6.8589709538352466,5.9544041426420202,10.64909648701742,319.99598604076448,118.39473244131145,201.60125359945303]
["Medium Urban",86463.845647867973,51230.335110000007,0.59250585867577876,144.183630345962,89.788842296721796,10.46898851722151,7.6468916152674353,3.4375119667258409,9.4054457962338294,264.93131053813244,79.027602519229347,185.9037080189031]
["Rural Regional",173662.15247477239,96390.619549999989,0.55504678582169764,232.00420024689015,119.71097565167588,28.717592986982726,7.4000694603897283,4.4468917411372741,14.743475730673426,407.0232058177491,104.30079375913712,302.72241205861201]
["Small Urban",38679.500948497116,25987.491940000004,0.67186730187142552,190.02163238381362,40.680186161897076,10.166802960824699,3.3903879683127274,0.42612423028614888,7.7313701708453522,252.4165038759796,37.695887785622133,214.72061609035745]
["Rural Collection - North",22803.380699003184,10226.450366000001,0.44846202854680378,249.1599058135985,63.368407101893908,95.727732982965705,12.595367443256997,6.6104266466451058,17.485297791548483,444.94713777990881,16.77648097431738,428.17065680559142]
["Rural Collection - South",75372.40466508278,40982.428920000013,0.54373253848149605,317.38572536515233,68.681774462283357,57.181541254534309,7.4289510900956088,3.9339308149527796,16.337965260844761,470.94988824786333,51.220641511942851,419.72924673592047]
["Rural Depot - North",16414.602656995376,5042.6587499999996,0.3072056543416225,21.317900998158965,84.932273079156928,510.52476830798844,5.4750304093054085,13.817218942289127,29.013063792984205,665.08025552988283,39.058240853597319,626.02201467628549]
["Rural Depot - South",18573.97774173606,6778.4235340000005,0.36494194341413266,47.220895595338575,41.56607927886968,386.90008330777749,10.173445146073107,1.4806436850188123,21.024092000917449,508.36523901399522,7.3962418766735025,500.96899713732171]
["Total",{"$f":"SUM(B5:B13)","v":1421593.3656332104},{"$f":"SUM(C5:C13)","v":892924.3881699997},{"$f":"C14/B14","v":0.62811519085295575},{"$f":"SUMPRODUCT(E5:E13,$C$5:$C$13)/SUM($C$5:$C$13)","v":197.68200393961476},{"$f":"SUMPRODUCT(F5:F13,$C$5:$C$13)/SUM($C$5:$C$13)","v":114.32741028523054},26.066938128661157,7.5037846751301407,6.7881432406861499,13.003468909384759,365.37174917870749,99.800666888083569,{"$f":"SUMPRODUCT(M5:M13,$C$5:$C$13)/SUM($C$5:$C$13)","v":265.57108229062391}]
[]
{"$rows_left_out":40}
{"sheet":"Additional Info","index":1,"n_rows":15,"n_cols":21,"rows_kept":15,"cut":false,"hidden":false,"merged":[]}
["Material","Change in Material Recovery",null,null,null,null,null,null,null,null,null,null,null,null,null,null,null,null,"Material","Goal","Default"]
["Printed Paper ",{"$f":"T2-U2","v":0},null,null,null,null,null,null,null,null,null,null,null,null,null,null,null,null,"Printed Paper ",{"$f":"SUM(Inputs!B26:B34)","v":504932.47040932905},504932.47040932905]
["OCC/OBB ",{"$f":"T3-U3","v":0},null,null,null,null,null,null,null,null,null,null,null,null,null,null,null,null,"OCC/OBB ",{"$f":"SUM(Inputs!C26:C34)","v":175408.80711423425},175408.80711423425]
["Mixed Paper ",0,null,null,null,null,null,null,null,null,null,null,null,null,null,null,null,null,"Mixed Paper ",{"$f":"SUM(Inputs!D26:D34)","v":20576.771636532711},20576.771636532711]
["Polycoat ",0,null,null,null,null,null,null,null,null,null,null,null,null,null,null,null,null,"Polycoat ",{"$f":"SUM(Inputs!E26:E34)","v":5819.7546041711648},5819.7546041711648]
["PET \n",0,null,null,null,null,null,null,null,null,null,null,null,null,null,null,null,null,"PET \n",{"$f":"SUM(Inputs!F26:F34)","v":31154.160725468821},31154.160725468821]
["HDPE ",0,null,null,null,null,null,null,null,null,null,null,null,null,null,null,null,null,"HDPE ",{"$f":"SUM(Inputs!G26:G34)","v":15339.264903483785},15339.264903483785]
["Plastic Film ",0,null,null,null,null,null,null,null,null,null,null,null,null,null,null,null,null,"Plastic Film ",{"$f":"SUM(Inputs!H26:H34)","v":4645.8763831797987},4645.8763831797987]
["Tubs and Lids ",0,null,null,null,null,null,null,null,null,null,null,null,null,null,null,null,null,"Tubs and Lids ",{"$f":"SUM(Inputs!I26:I34)","v":2684.662658377988},2684.662658377988]
["Polystyrene ",0,null,null,null,null,null,null,null,null,null,null,null,null,null,null,null,null,"Polystyrene ",{"$f":"SUM(Inputs!J26:J34)","v":199.56913470118596},199.56913470118596]
["Mixed Plastic ",0,null,null,null,null,null,null,null,null,null,null,null,null,null,null,null,null,"Mixed Plastic ",{"$f":"SUM(Inputs!K26:K34)","v":15658.185882169877},15658.185882169877]
["Steel \n",0,null,null,null,null,null,null,null,null,null,null,null,null,null,null,null,null,"Steel \n",{"$f":"SUM(Inputs!L26:L34)","v":30122.961517778258},30122.961517778258]
["Aluminum ",0,null,null,null,null,null,null,null,null,null,null,null,null,null,null,null,null,"Aluminum ",{"$f":"SUM(Inputs!M26:M34)","v":10461.763507285596},10461.763507285596]
["Flint Glass\n",0,null,null,null,null,null,null,null,null,null,null,null,null,null,null,null,null,"Flint Glass\n",{"$f":"SUM(Inputs!N26:N34)","v":72589.280042624014},72589.280042624014]
["Coloured Glas\n",0,null,null,null,null,null,null,null,null,null,null,null,null,null,null,null,null,"Coloured Glas\n",{"$f":"SUM(Inputs!O26:O34)","v":15907.789983666868},15907.789983666868]
{"$rows_left_out":1}
{"sheet":"Growth Trends","index":2,"n_rows":190,"n_cols":17,"rows_kept":190,"cut":false,"hidden":true,"merged":[]}
[]
[]
["Category","Material","2005 Quantity Generated","2006 Quantity Generated","2007 Quantity Generated","2008 Quantity Generated","2009 Quantity Generated","2010 Quantity Generated","2011 Quantity Generated","2012 Quantity Generated","2013 Quantity Generated","2014 Quantity Generated","2015 Quantity Generated","2016 Quantity Generated","2017 Quantity Generated","2018 Quantity Generated","2019 Quantity Generated"]
[null,null,"(tonnes)","(tonnes)","(tonnes)","(tonnes)","(tonnes)","(tonnes)","(tonnes)","(tonnes)","(tonnes)","(tonnes)","(tonnes)","(tonnes)","(tonnes)","(tonnes)","(tonnes)"]
["PRINTED PAPER"]
[null,"Newsprint - CNA/OCNA",264800,283482.95744999999,268224.00157447328,259569.79615605751,269247.11961414898,255784.76363344153,226369.51581559575,212787.8,213799.69338406078,217374.81810596661,203648.92356063001,195740.71937649499,187832.51519235899,179924.311008224,172016.10682408899]
[null,"Newsprint - Non-CNA/OCNA",136400,134698.7691,128557.06584338658,124409.19224047725,129047.4360280832,125176.0129472407,110780.77145830802,117427.86,145964.584,148405.38073137644,132970.25444282399,133494.53575335801,134018.817063892,134543.09837442599,135067.37968496]
[null,"Magazines and Catalogues",95100,96349.242704410965,97267.035520571153,89652.602943666512,91111.662738234882,91339.441895080468,85585.057055690399,83017.45,78941.772871898851,78908.18383801452,77033.864276910404,74907.795062392805,72781.725847875306,70655.656633357794,68529.587418840296]
[null,"Telephone Books",15000,16089.739,21089.638859999999,14431.042369999999,19932.509180000001,15391.626999999999,13852.4643,10389,9002.4606879637558,8328.9162403126684,8703.0560067796905,7676.2044145890904,6649.3528223985904,5622.5012302079904,4595.6496380174904]
[null,"Other Printed Paper",127800,129368.38858257126,122082.08326045396,117200.04989890855,120303.46148240866,121205.73744352671,118781.62269465618,114030.72,125433.79200000002,128244.95237551829,120506.83321873,120154.424572352,119802.01592597501,119449.607279598,119097.19863322101]
["Printed Paper Total",null,639100,659989.09683698229,637219.82505888504,605262.68360910984,629642.18904287566,608897.58291928947,555369.4313242503,537652.82999999996,573142.30294392339,581262.25129118853,542862.93150587298,531973.679179186,521084.42685250001,510195.17452581302,499305.92219912598]
[]
["PACKAGING"]
["Paper Based Packaging","Corrugated Cardboard",140000,141800,165706.18372141192,162845.69325969444,162846.52599156799,169170.41935236985,173399.67983617907,171666,173382.66,169360.64246157563,181454.75835019199,184806.936147995,188159.113945797,191511.29174359899,194863.46954140201]
[null,"Boxboard",130500,132200,127388.21835961373,123773.55147289456,127665.94721629177,130538.43102865833,127274.97025294187,128547.75,157200.92650000012,163987.51376088095,151426.681115874,154430.1266171,157433.57211832699,160437.01761955299,163440.46312078001]
{"$rows_left_out":176}
{"sheet":"Sheet10","index":3,"n_rows":103,"n_cols":15,"rows_kept":103,"cut":false,"hidden":false,"merged":[]}
[217374.81810596661,203689.270999787,173.28806981228675,87.946791632727013,85.341278179559737]
[148405.38073137644,139062.03154996553,173.28806981228675,87.946791632727013,85.341278179559737]
[78908.18383801452,61776.102223864626,173.28806981228675,87.946791632727013,85.341278179559737]
[8328.9162403126684,7967.8423980268217,210.88693397004505,91.610673219373894,119.27626075067116]
[128244.95237551829,57949.176957380616,185.31137655950539,89.039905632608011,96.271470926897379]
[]
[169360.64246157563,144539.03810988681,482.51607674717889,117.83776488663219,364.67831186054673]
[163987.51376088095,67997.796324247101,287.67136071967542,88.713540322343661,198.95782039733177]
[14248.791040988721,6833.1536140952358,1170.5998904010419,97.934303869079926,1072.6655865319619]
[39205.144140545424,1264.1135402506993,960.47606763496663,0,960.47606763496663]
[5819.7309000000005,954.62919918520697,960.47606763496674,95.91008579968701,864.56598183527967]
[]
[56847.711144527268,32700.663520034239,1280.5498078769906,425.23372709039819,855.31608078659247]
[27597.634192494679,16408.752630162984,1196.3699969306122,473.77655925431907,722.59343767629309]
[54382.762759131001,4923.3136068582407,1894.737420466658,33.162494279988238,1861.5749261866697]
{"$rows_left_out":89}
{"sheet":"2012 Macro Cost Data","index":4,"n_rows":257,"n_cols":11,"rows_kept":257,"cut":false,"hidden":true,"merged":[[246,1,250,12],[251,1,252,12]]}
[]
[null,"2012 Blue Box Financial Details"]
[]
["Municipal Grouping","Marketed or Calculated Marketed Tonnes","Residential Collection Costs","Residential Processing Costs ","Residential Depot/Transfer Costs","Residential Promotion & Education Costs","Interest on Municipal Capital","Adminstration Costs","Gross Costs ","Total Gross Revenue","Net Cost "]
[1,41298.58,5130395.68,3219575.71,48119.7,200371.68999999997,21475.35,310533.7,8930471.8299999982,1302216.6500000001,7628255.1799999978]
[1,38422.15,7922612.29,3479644.93,124144.33,145501.86000000002,173053.91,394518.97,12239476.290000001,4535360.72,7704115.5700000012]
[1,26669.9,5084528.22,4153375.59,66046.289999999994,228337.97,268180.84999999998,332513,10132981.919999998,3605121.89,6527860.0299999975]
[1,86950.399999999994,19937202.43,14095723.1,286940.40000000002,673487.78,943555.54,1242238.82,37179148.07,9639556.459999999,27539591.609999999]
[1,156465,33215934.300000001,22397573.539999999,7232374,1806726,1578717.86,2811315.78,69042641.480000004,16074934,52967707.480000004]
[1,76736.710000000006,9252969.9499999993,11149290.92,2826032.28,347096.06,783978.41,832345.29,25191712.909999996,9157217.6100000013,16034495.299999995]
[null,426542.74000000005,188.82900895230333,137.13791914498415,24.812653006355234,7.9746319442689364,8.8360709644243371,13.887155974100038,381.47743998643602,103.89206795548787,277.58537203094812]
[2,44429.08,9578932.4499999993,5314154.6900000004,241957.32,469394.3,474426.19,556715.6,16635580.550000001,6277101.3600000003,10358479.190000001]
[2,24918.31,3756911.1499999994,2850965.04,10045.69,189889.61,239425.16,254074.8,7301311.4500000002,3405334.58,3895976.87]
[2,39464.89,6658374.7400000002,4066967.16,162198.55000000002,434786.96999999991,352507.01,423126.72,12097961.150000002,4392299.3600000003,7705661.7900000019]
[2,60885.53,12603398.73,5575973.4299999997,0,59444.22,132805.26999999999,608304.67000000004,18979926.32,7949330.9299999997,11030595.390000001]
{"$rows_left_out":243}
{"sheet":"2012 BB Tonnes (2)","index":5,"n_rows":265,"n_cols":53,"rows_kept":265,"cut":false,"hidden":false,"merged":[[1,10,1,15],[1,16,1,17],[1,18,1,19],[1,2,2,2],[1,1,2,1],[1,3,2,3],[1,4,2,4],[1,5,2,5],[1,6,1,9]]}
[]
[null,"PC","Group","Municipality","Total Households Served","TOTAL Reported and/or Calculated Marketed Tonnes1","Paper (tonnes)",null,null,null,"Plastic (tonnes)",null,null,null,null,null,"Metal (tonnes)",null,"Glass (tonnes)"]
[null,null,null,null,null,null,"Printed Paper Reported and/or Calculated Marketed2","OCC/OBB Reported and/or Calculated Marketed3","Mixed Paper Reported and/or Calculated Marketed4","Polycoat Reported and/or Calculated Marketed5","PET \nReported and/or Calculated Marketed","HDPE Reported and/or Calculated Marketed","Plastic Film Reported and/or Calculated Marketed","Tubs and Lids Reported and/or Calculated Marketed","Polystyrene Reported and/or Calculated Marketed","Mixed Plastic Reported and/or Calculated Marketed6","Steel \nReported and/or Calculated Marketed","Aluminum Reported and/or Calculated Marketed","Flint \nReported and/or Calculated Marketed","Coloured \nReported and/or Calculated Marketed"]
[null,null,null,null,{"$f":"SUM(E5:E242)","v":5192895},{"$f":"SUM(F11,F18,F41,F65,F98,F162,F209,F243)","v":841694.05305999983},{"$f":"SUM(G5:G242)","v":587042.46888687171},200234.06304770935,25591.72058813092,6651.8713353277644,37432.805144334539,18400.417145606447,5542.8718772974871,3336.5560433560513,211.48561725792226,18042.596311328132,35921.490063270612,12905.697446064043,83374.991447091379,20020.624076144435]
[null,1,1,"HALTON, REGIONAL MUNICIPALITY OF",183677,41298.58,26870.79,5923.8099999999995,241,186.23,1300.5996399205646,614.67610042307103,0.9113625858225668,183.04009719312538,3.346069745811564E-2,326.35509409908479,1197.3178211626519,501.93305846239076,3319.5820269828978,632.30133847293291,null,null,null,null,null,null,null,null,null,null,null,null,null,null,null,null,null,null,null,null,null,null,null,null,null,null,null,null,null,null,null,null,{"$f":"+X5-AM5","v":0}]
[null,20,1,"TORONTO, CITY OF",1000936,156465,92436.665110794827,34539.738160513269,0,808.54281779808821,3801.7859577551094,2318.1778409826911,267.13279226793935,304.45732610657933,57.07348592392929,751.87728790926462,4003.0906239317028,1104.5456390099603,13500.406883885584,2571.5060731210638]
[null,50,1,"LONDON, CITY OF",168568,26669.900000000005,13684.15,5742.9400000000005,691.75,230.9,1259.74771599,496.39,182.06,0,0,572.51228400999992,1011.63,378.73,0,2419.09]
[null,97,1,"YORK, REGIONAL MUNICIPALITY OF",332788,76736.710000000006,49053.02,9461.94,0,381.66,2575.5216217399998,1422.59,0,0,12.55,639.93837825999992,2170.33,708.25,8661.1643999999997,1649.7456]
[null,172,1,"HAMILTON, CITY OF",215733,38422.150000000009,19447.514669473883,9478.7853305261197,0,177.25,1380.4864764500001,626.89,488.1,0,17.29,959.70352354999989,1478.33,526.79,3226.4484000000002,614.5616]
[null,270,1,"PEEL, REGIONAL MUNICIPALITY OF",416500,86950.399999999994,55948.72,14791.12,0,546.78,2131.9938501800002,1277.5500000000002,853.4,238.59,0,72.06614981999995,2227.9299999999998,783.53,6786.1247999999996,1292.5952]
[null,null,null,"Group 1 Weighted Average",null,{"$f":"SUM(F5:F10)","v":426542.74},{"$f":"SUMPRODUCT(G5:G10,$F$5:$F$10)/SUM($F$5:$F$10)","v":59346.759644141734},19173.778379238582,66.586202135335853,525.14823013580758,2621.5725441630584,1513.7344479715375,327.39372165111223,178.04008939972579,24.75425918251106,559.46596633946569,2625.3762441929862,812.04048478763752,8505.8013131865227,1771.4080208501841,{"$f":"SUM(G11:T11)","v":98051.859547376196}]
[null,6,2,"DURHAM, REGIONAL MUNICIPALITY OF",213317,44429.08,25353.11,4948.45,3296.23,449.37,2065.7722868000001,809.84,0,494.47,0,69.827713199999948,1668.06,690.51,3850.0895999999993,733.35039999999992]
[null,18,2,"ESSEX-WINDSOR SOLID WASTE AUTHORITY",164356,24918.309999999998,14788.630000000001,4987.66,0,54.63,875.12869713000009,460.01,0,0,0,491.56130287000002,948.95376272873125,317.69623727126884,1712.9679999999998,281.072]
[null,53,2,"WATERLOO, REGIONAL MUNICIPALITY OF",199450,34534.409999999996,23772.181845351333,2919.288154648666,0,387.1,1611.5267980000001,664.44,0,0,0,1154.0332019999998,1110.3399999999999,505.68,2024.2488000000001,385.57120000000003]
[null,335,2,"SIMCOE, COUNTY OF",131150,25511.019999999997,2918.63,3915.42,9713.69,153.44,1294.7467133453915,677.21050761693709,76.72457822511582,769.94898236524853,2.816944583340562,47.294761322155061,1214.890304279797,560.09361508713323,3225.9198182669002,940.19377490798104]
{"$rows_left_out":251}
{"sheet":"2012 BB Category Details","index":6,"n_rows":253,"n_cols":12,"rows_kept":253,"cut":false,"hidden":false,"merged":[[247,2,251,10],[252,2,253,10]]}
[]
[null,"2012 Blue Box Financial Details"]
[]
[null,"Program Code","Group #","Program Name","Marketed or Calculated Marketed Tonnes","Single Stream","Residential Collection Costs Per Tonne Marketed","Residential Processing Costs Per Tonne Marketed","Residential Depot/Transfer Costs Per Tonne Marketed","Residential Promotion & Education Costs Per Tonne Marketed","Calculated Administration1 and Interest on Municipal Capital2 Per Tonne Marketed","Gross Costs Per Tonne Marketed"]
[null,1,{"$f":"VLOOKUP(B5,'2012 BB Tonnes (2)'!$B$5:$C$243,2,FALSE)","v":1},"HALTON, REGIONAL MUNICIPALITY OF",41298.58,"Y",124.22692693065959,77.958508742915612,1.1651659693868408,4.8517815866792509,8.0392364580089666,2696.0955719861722]
[null,172,{"$f":"VLOOKUP(B6,'2012 BB Tonnes (2)'!$B$5:$C$243,2,FALSE)","v":1},"HAMILTON, CITY OF",38422.15,"N",206.19908802604746,90.563514274968995,3.2310615100924855,3.7869265514813724,14.772022908660759,784.88436632747459]
[null,50,{"$f":"VLOOKUP(B7,'2012 BB Tonnes (2)'!$B$5:$C$243,2,FALSE)","v":1},"LONDON, CITY OF",26669.9,"N",190.64669233855392,155.73270203487826,2.4764356071826286,8.5616357766620794,22.523288426278313,490.51554109800509]
[null,270,{"$f":"VLOOKUP(B8,'2012 BB Tonnes (2)'!$B$5:$C$243,2,FALSE)","v":1},"PEEL, REGIONAL MUNICIPALITY OF",86950.399999999994,"Y",229.29397024050493,162.11222835087591,3.3000469233034009,7.7456547640953932,25.138404883703817,363.42260555093139]
[null,20,{"$f":"VLOOKUP(B9,'2012 BB Tonnes (2)'!$B$5:$C$243,2,FALSE)","v":1},"TORONTO, CITY OF",156465,"Y",212.28986866072285,143.14749969641773,46.223589940242228,11.5471575112645,28.057608027354359,894.16077367395371]
[null,97,{"$f":"VLOOKUP(B10,'2012 BB Tonnes (2)'!$B$5:$C$243,2,FALSE)","v":1},"YORK, REGIONAL MUNICIPALITY OF",76736.710000000006,"Y",120.58074877069917,145.29279298004826,36.827644552392194,4.5232074713653994,21.06323948472641,167.97735320153436]
[null,null,null,null,null,null,{"$f":"SUMPRODUCT(G5:G10,$E$5:$E$10)/SUM($E$5:$E$10)","v":188.82900895230333},{"$f":"SUMPRODUCT(H5:H10,$E$5:$E$10)/SUM($E$5:$E$10)","v":137.13791914498415},24.812653006355234,7.9746319442689364,22.723226938524373]
[null,6,{"$f":"VLOOKUP(B12,'2012 BB Tonnes (2)'!$B$5:$C$243,2,FALSE)","v":2},"DURHAM, REGIONAL MUNICIPALITY OF",44429.08,"N",215.60051322242097,119.60982964310763,5.4459223553582472,10.565024078824049,23.208713527266376,872.32235574717913]
[null,18,{"$f":"VLOOKUP(B13,'2012 BB Tonnes (2)'!$B$5:$C$243,2,FALSE)","v":2},"ESSEX-WINDSOR SOLID WASTE AUTHORITY",24918.31,"N",150.76909910824608,114.41245574037725,0.40314491632859534,7.6204850971032938,19.804712277839066,246.35492814076738]
[null,357,{"$f":"VLOOKUP(B14,'2012 BB Tonnes (2)'!$B$5:$C$243,2,FALSE)","v":2},"NIAGARA, REGIONAL MUNICIPALITY OF",39464.89,"N",168.71641451426825,103.05279350835642,4.1099455744080373,11.017057693560021,19.653766423775664,569.67563939669628]
[null,441,{"$f":"VLOOKUP(B15,'2012 BB Tonnes (2)'!$B$5:$C$243,2,FALSE)","v":2},"OTTAWA, CITY OF",60885.53,"N",207.00154420927274,91.581257977059565,0,0.97632754449209858,12.172185082399711,448.81173197310454]
{"$rows_left_out":238}